Reaction Details
TargetAldo-keto reductase family 1 member B1 [K65Q]
LigandBDBM16312
Substrate/Competitorn/a
Meas. Tech.ChEMBL_32261 (CHEMBL645595)
IC50 1560±n/a nM
Citation Costantino, LRastelli, GGamberini, MCVinson, JABose, PIannone, AStaffieri, MAntolini, LDel Corso, AMura, UAlbasini, A 1-Benzopyran-4-one antioxidants as aldose reductase inhibitors. J Med Chem42:1881-93 (1999) 
 
Aldo-keto reductase family 1 member B1 [K65Q]
Name:Aldo-keto reductase family 1 member B1 [K65Q]
Type:Protein
Mol. Mass.:35916.27
Organism:Bos taurus (Cattle)
Description:P16116[K65Q]
Residue:315
BDBM16312
NameBDBM16312
Synonyms:(4S)-6-fluoro-2,3-dihydrospiro[1-benzopyran-4,4'-imidazolidine]-2',5'-dione Sorbinil
TypeSmall organic molecule
Emp. Form.C11H9FN2O3
Mol. Mass.236.1992
SMILESFc1ccc2OCC[C@]3(NC(=O)NC3=O)c2c1