Reaction Details
TargetOrnithine transcarbamylase, mitochondrial
LigandBDBM50162816
Substrate/Competitorn/a
Meas. Tech.ChEMBL_148266 (CHEMBL750183)
pH6±n/a
Ki>20000000±n/a nM
Commentsextracted
Citation Flohr, AAemissegger, AHilvert, D alpha-Functionalized phosphonylphosphinates: synthesis and evaluation as transcarbamoylase inhibitors. J Med Chem42:2633-40 (1999) 
 
Ornithine transcarbamylase, mitochondrial
Name:Ornithine transcarbamylase, mitochondrial
Type:PROTEIN
Mol. Mass.:39943.22
Organism:Homo sapiens (Human)
Description:ChEMBL_148264
Residue:354
BDBM50162816
NameBDBM50162816
Synonyms:CHEMBL180570 Methylene diphsphonate methylenediphosphonic acid
TypeSmall organic molecule
Emp. Form.CH6O6P2
Mol. Mass.176.0023
SMILESOP(O)(=O)CP(O)(O)=O