Reaction Details
TargetOrnithine transcarbamylase, mitochondrial
LigandBDBM50079019
Substrate/Competitorn/a
Meas. Tech.ChEMBL_148266 (CHEMBL750183)
pH6±n/a
Ki 660000±n/a nM
Commentsextracted
Citation Flohr, AAemissegger, AHilvert, D alpha-Functionalized phosphonylphosphinates: synthesis and evaluation as transcarbamoylase inhibitors. J Med Chem42:2633-40 (1999) 
 
Ornithine transcarbamylase, mitochondrial
Name:Ornithine transcarbamylase, mitochondrial
Type:PROTEIN
Mol. Mass.:39943.22
Organism:Homo sapiens (Human)
Description:ChEMBL_148264
Residue:354
BDBM50079019
NameBDBM50079019
Synonyms:2-Amino-5-[(hydroxy-phosphonomethyl-phosphinoylmethyl)-amino]-pentanoic acid
TypeSmall organic molecule
Emp. Form.C7H17N2O7P2
Mol. Mass.303.1672
SMILES[NH3+][C@@H](CCC[NH2+]CP([O-])(=O)CP(O)([O-])=O)C([O-])=O