Reaction Details
TargetOrnithine transcarbamylase, mitochondrial
LigandBDBM50079025
Substrate/Competitorn/a
Meas. Tech.ChEMBL_148266 (CHEMBL750183)
pH6±n/a
Ki>20000000±n/a nM
Commentsextracted
Citation Flohr, AAemissegger, AHilvert, D alpha-Functionalized phosphonylphosphinates: synthesis and evaluation as transcarbamoylase inhibitors. J Med Chem42:2633-40 (1999) 
 
Ornithine transcarbamylase, mitochondrial
Name:Ornithine transcarbamylase, mitochondrial
Type:PROTEIN
Mol. Mass.:39943.22
Organism:Homo sapiens (Human)
Description:ChEMBL_148264
Residue:354
BDBM50079025
NameBDBM50079025
Synonyms:(2S)-2-ammonio-4-[({[(hydroxyphosphinato)methyl]phosphinato}methyl)ammonio]butanoate
TypeSmall organic molecule
Emp. Form.C6H15N2O7P2
Mol. Mass.289.1406
SMILES[NH3+][C@@H](CC[NH2+]CP([O-])(=O)CP(O)([O-])=O)C([O-])=O