Reaction Details
TargetOrnithine transcarbamylase, mitochondrial
LigandBDBM14671
Substrate/Competitorn/a
Meas. Tech.ChEMBL_148266 (CHEMBL750183)
pH6±n/a
Ki>20000000±n/a nM
Commentsextracted
Citation Flohr, AAemissegger, AHilvert, D alpha-Functionalized phosphonylphosphinates: synthesis and evaluation as transcarbamoylase inhibitors. J Med Chem42:2633-40 (1999) 
 
Ornithine transcarbamylase, mitochondrial
Name:Ornithine transcarbamylase, mitochondrial
Type:PROTEIN
Mol. Mass.:39943.22
Organism:Homo sapiens (Human)
Description:ChEMBL_148264
Residue:354
BDBM14671
NameBDBM14671
Synonyms:Fragment 1 phosphoric acid
TypeSmall organic molecule
Emp. Form.H3O4P
Mol. Mass.97.9952
SMILESOP(O)(O)=O