Reaction Details
TargetOrnithine transcarbamylase, mitochondrial
LigandBDBM50079021
Substrate/Competitorn/a
Meas. Tech.ChEMBL_148265 (CHEMBL753865)
pH7±n/a
Ki 1000000±n/a nM
Commentsextracted
Citation Flohr, AAemissegger, AHilvert, D alpha-Functionalized phosphonylphosphinates: synthesis and evaluation as transcarbamoylase inhibitors. J Med Chem42:2633-40 (1999) 
 
Ornithine transcarbamylase, mitochondrial
Name:Ornithine transcarbamylase, mitochondrial
Type:PROTEIN
Mol. Mass.:39943.22
Organism:Homo sapiens (Human)
Description:ChEMBL_148264
Residue:354
BDBM50079021
NameBDBM50079021
Synonyms:(2S)-2-[(tert-butoxycarbonyl)amino]-5-[({[(hydroxyphosphinato)methyl]phosphinato}methyl)ammonio]pentanoate
TypeSmall organic molecule
Emp. Form.C12H24N2O9P2
Mol. Mass.402.2756
SMILESCC(C)(C)OC(=O)N[C@@H](CCC[NH2+]CP([O-])(=O)CP(O)([O-])=O)C([O-])=O