Reaction Details
TargetHistamine H1 receptor
LigandBDBM112777
Substrate/Competitorn/a
Meas. Tech.ChEMBL_84698 (CHEMBL692702)
IC50 0.05±n/a nM
Citation Quiñones-Torrelo, CSagrado, SVillanueva-Camañas, RMMedina-Hernández, MJ Development of predictive retention-activity relationship models of tricyclic antidepressants by micellar liquid chromatography. J Med Chem42:3154-62 (1999) 
 
Histamine H1 receptor
Name:Histamine H1 receptor
Type:Enzyme Catalytic Domain
Mol. Mass.:55716.35
Organism:RAT
Description:HISTAMINE H1 HRH1 RAT::P31390
Residue:486
BDBM112777
NameBDBM112777
Synonyms:NORTRIPTYLINE | US8629135, SW-02
TypeSmall organic molecule
Emp. Form.C19H21N
Mol. Mass.263.3767
SMILES[#6]-[#7]-[#6]-[#6]\[#6]=[#6]-1/c2ccccc2-[#6]-[#6]-c2ccccc-12