Reaction Details
TargetSodium-dependent dopamine transporter
LigandBDBM50080561
Substrate/Competitorn/a
Meas. Tech.ChEMBL_61660 (CHEMBL670937)
Ki 26±n/a nM
Citation Choi, SWElmaleh, DRHanson, RNFischman, AJ Design, synthesis, and biological evaluation of novel non-piperazine analogues of 1-[2-(diphenylmethoxy)ethyl]- and 1-[2-[bis(4-fluorophenyl)methoxy]ethyl]-4-(3-phenylpropyl)piperazines as dopamine transporter inhibitors. J Med Chem42:3647-56 (1999) 
 
Sodium-dependent dopamine transporter
Name:Sodium-dependent dopamine transporter
Type:Multi-pass membrane protein
Mol. Mass.:68497.11
Organism:Homo sapiens (Human)
Description:Q01959
Residue:620
BDBM50080561
NameBDBM50080561
Synonyms:CHEMBL121460 | N,N'-Bis-{2-[bis-(4-fluoro-phenyl)-methoxy]-ethyl}-N,N'-dimethyl-ethane-1,2-diamine
TypeSmall organic molecule
Emp. Form.C34H36F4N2O2
Mol. Mass.580.6555
SMILESCN(CCOC(c1ccc(F)cc1)c1ccc(F)cc1)CCN(C)CCOC(c1ccc(F)cc1)c1ccc(F)cc1