Reaction Details
TargetSodium-dependent noradrenaline transporter
LigandBDBM50080564
Substrate/Competitorn/a
Meas. Tech.ChEMBL_142935 (CHEMBL750364)
Ki 477±n/a nM
Citation Choi, SWElmaleh, DRHanson, RNFischman, AJ Design, synthesis, and biological evaluation of novel non-piperazine analogues of 1-[2-(diphenylmethoxy)ethyl]- and 1-[2-[bis(4-fluorophenyl)methoxy]ethyl]-4-(3-phenylpropyl)piperazines as dopamine transporter inhibitors. J Med Chem42:3647-56 (1999) 
 
Sodium-dependent noradrenaline transporter
Name:Sodium-dependent noradrenaline transporter
Type:Multi-pass membrane protein
Mol. Mass.:69337.72
Organism:Homo sapiens (Human)
Description:P23975
Residue:617
BDBM50080564
NameBDBM50080564
Synonyms:CHEMBL420900 | N-(3-{2-[Bis-(4-fluoro-phenyl)-methoxy]-ethylamino}-propyl)-2-phenyl-acetamide
TypeSmall organic molecule
Emp. Form.C26H28F2N2O2
Mol. Mass.438.5095
SMILESFc1ccc(cc1)C(OCCNCCCNC(=O)Cc1ccccc1)c1ccc(F)cc1