Reaction Details
TargetSodium-dependent serotonin transporter
LigandBDBM50080569
Substrate/Competitorn/a
Meas. Tech.ChEMBL_201477 (CHEMBL804586)
Ki 125±n/a nM
Citation Choi, SWElmaleh, DRHanson, RNFischman, AJ Design, synthesis, and biological evaluation of novel non-piperazine analogues of 1-[2-(diphenylmethoxy)ethyl]- and 1-[2-[bis(4-fluorophenyl)methoxy]ethyl]-4-(3-phenylpropyl)piperazines as dopamine transporter inhibitors. J Med Chem42:3647-56 (1999) 
 
Sodium-dependent serotonin transporter
Name:Sodium-dependent serotonin transporter
Type:Multi-pass membrane protein
Mol. Mass.:70322.51
Organism:Homo sapiens (Human)
Description:P31645
Residue:630
BDBM50080569
NameBDBM50080569
Synonyms:CHEMBL121611 | N-{2-[Bis-(4-fluoro-phenyl)-methoxy]-ethyl}-N'-phenethyl-propane-1,3-diamine
TypeSmall organic molecule
Emp. Form.C26H30F2N2O
Mol. Mass.424.526
SMILESFc1ccc(cc1)C(OCCNCCCNCCc1ccccc1)c1ccc(F)cc1