Reaction Details
TargetSigma non-opioid intracellular receptor 1
LigandBDBM50081380
Substrate/Competitorn/a
Meas. Tech.ChEMBL_201434 (CHEMBL809837)
IC50 1.5±n/a nM
Citation Nakazato, AKumagai, TOhta, KChaki, SOkuyama, STomisawa, K Synthesis and SAR of 1-alkyl-2-phenylethylamine derivatives designed from N,N-dipropyl-4-methoxy-3-(2-phenylethoxy)phenylethylamine to discover sigma(1) ligands. J Med Chem42:3965-70 (1999) Sigma non-opioid intracellular receptor 1
Name:Sigma non-opioid intracellular receptor 1
Type:Enzyme Catalytic Domain
Mol. Mass.:25124.85
Organism:Homo sapiens (Human)
Description:Q99720
Residue:223
BDBM50081380
NameBDBM50081380
Synonyms:CHEMBL553962 | [1-(4-Methoxy-3-phenethyloxy-benzyl)-hexyl]-propyl-amine; hydrochloride
TypeSmall organic molecule
Emp. Form.C25H37NO2
Mol. Mass.383.5668
SMILESCCCCCC(Cc1ccc(OC)c(OCCc2ccccc2)c1)NCCC