Reaction Details
TargetSodium-dependent serotonin transporter
LigandBDBM50084717
Substrate/Competitorn/a
Meas. Tech.ChEMBL_202150 (CHEMBL808138)
Ki 172±n/a nM
Citation Husbands, SMIzenwasser, SKopajtic, TBowen, WDVilner, BJKatz, JLNewman, AH Structure-activity relationships at the monoamine transporters and sigma receptors for a novel series of 9-[3-(cis-3, 5-dimethyl-1-piperazinyl)propyl]carbazole (rimcazole) analogues. J Med Chem42:4446-55 (1999) Sodium-dependent serotonin transporter
Name:Sodium-dependent serotonin transporter
Type:Multi-pass membrane protein
Mol. Mass.:70168.43
Organism:Rattus norvegicus (rat)
Description:P31652
Residue:630
BDBM50084717
NameBDBM50084717
Synonyms:(+)-(1R,2R,3S,5S)-methyl 3-(benzoyloxy)-8-methyl-8-aza-bicyclo[3.2.1]octane-2-carboxylate (1R,2R,3S,5S)-methyl 3-(benzoyloxy)-8-methyl-8-aza-bicyclo[3.2.1]octane-2-carboxylate (1R,2R,3S,5S)-methyl 3-(benzyloxy)-8-methyl-8-aza-bicyclo[3.2.1]octane-2-carboxylate (2R,3S)-3-Benzoyloxy-2-methoxycarbonyl-8-methyl-8-azonia-bicyclo[3.2.1]octane (2R,3S,5R)-3-Benzoyloxy-8-methyl-8-aza-bicyclo[3.2.1]octane-2-carboxylic acid methyl ester (2R,3S,8S)-3-Benzoyloxy-8-methyl-8-aza-bicyclo[3.2.1]octane-2-carboxylic acid methyl ester (3S,8R)-3-Benzoyloxy-8-methyl-8-aza-bicyclo[3.2.1]octane-2-carboxylic acid methyl ester (R)-3-Benzoyloxy-8-methyl-8-aza-bicyclo[3.2.1]octane-2-carboxylic acid methyl ester (cocaine)3-Benzoyloxy-8-methyl-8-aza-bicyclo[3.2.1]octane-2-carboxylic acid methyl ester 3-Benzoyloxy-6-methyl-6-aza-bicyclo[3.2.2]nonane-4-carboxylic acid methyl ester 3-Benzoyloxy-8-methyl-8-aza-bicyclo[3.2.1]octane-2-carboxylic acid methyl ester 3-Benzoyloxy-8-methyl-8-aza-bicyclo[3.2.1]octane-2-carboxylic acid methyl ester(Cocaine) 4-(4-Chloro-benzyl)-2-(1-methyl-azepan-4-yl)-2H-phthalazin-1-one CHEMBL120901 R-3-Benzoyloxy-8-methyl-8-aza-bicyclo[3.2.1]octane-2-carboxylic acid methyl ester methyl 8-methyl-3-phenylcarbonyloxy-(3S)-8-azabicyclo[3.2.1]octane-2-carboxylate methyl 8-methyl-3-phenylcarbonyloxy-(5R)-8-azabicyclo[3.2.1]octane-2-carboxylate
TypeSmall organic molecule
Emp. Form.C17H21NO4
Mol. Mass.303.3529
SMILESCOC(=O)[C@@H]1C2CCC(C[C@@H]1C(=O)Oc1ccccc1)N2C