Reaction Details
TargetProthrombin
LigandBDBM50082583
Substrate/Competitorn/a
Meas. Tech.ChEMBL_210598 (CHEMBL816565)
Ki 15±n/a nM
Citation Brundish, DBull, ADonovan, VFullerton, JDGarman, SMHayler, JFJanus, DKane, PDMcDonnell, MSmith, GPWakeford, RWalker, CVHowarth, GHoyle, WAllen, MCAmbler, JButler, KTalbot, MD Design and synthesis of thrombin inhibitors: analogues of MD-805 with reduced stereogenicity and improved potency. J Med Chem42:4584-603 (1999) Prothrombin
Name:Prothrombin
Type:Enzyme
Mol. Mass.:70502.73
Organism:Bos taurus (Bovine)
Description:P00735
Residue:625
BDBM50082583
NameBDBM50082583
Synonyms:Acetic acid 2-{1-[5-guanidino-2-(3-methyl-1,2,3,4-tetrahydro-quinoline-8-sulfonylamino)-pentanoyl]-piperidin-4-yl}-ethyl ester | CHEMBL357920
TypeSmall organic molecule
Emp. Form.C25H40N6O5S
Mol. Mass.536.687
SMILESCC1CNc2c(C1)cccc2S(=O)(=O)NC(CCCNC(N)=N)C(=O)N1CCC(CCOC(C)=O)CC1