Reaction Details
TargetC-C chemokine receptor type 1
LigandBDBM50082688
Substrate/Competitorn/a
Meas. Tech.ChEMBL_41751 (CHEMBL651702)
Ki 45±n/a nM
Citation Ng, HPMay, KBauman, JGGhannam, AIslam, ILiang, MHoruk, RHesselgesser, JSnider, RMPerez, HDMorrissey, MM Discovery of novel non-peptide CCR1 receptor antagonists. J Med Chem42:4680-94 (1999) C-C chemokine receptor type 1
Name:C-C chemokine receptor type 1
Type:Enzyme
Mol. Mass.:41180.69
Organism:Homo sapiens (Human)
Description:P32246
Residue:355
BDBM50082688
NameBDBM50082688
Synonyms:5-{3-[4-(4-Chloro-phenyl)-4-hydroxy-piperidin-1-yl]-propyl}-10,11-dihydro-5H-dibenzo[a,d]cycloheptene-5-carbonitrile | CHEMBL433746
TypeSmall organic molecule
Emp. Form.C30H31ClN2O
Mol. Mass.471.033
SMILESOC1(CCN(CCCC2(C#N)c3ccccc3CCc3ccccc23)CC1)c1ccc(Cl)cc1