Reaction Details
TargetC-C chemokine receptor type 1
LigandBDBM50082711
Substrate/Competitorn/a
Meas. Tech.ChEMBL_41751 (CHEMBL651702)
Ki 244±n/a nM
Citation Ng, HPMay, KBauman, JGGhannam, AIslam, ILiang, MHoruk, RHesselgesser, JSnider, RMPerez, HDMorrissey, MM Discovery of novel non-peptide CCR1 receptor antagonists. J Med Chem42:4680-94 (1999) C-C chemokine receptor type 1
Name:C-C chemokine receptor type 1
Type:Enzyme
Mol. Mass.:41180.69
Organism:Homo sapiens (Human)
Description:P32246
Residue:355
BDBM50082711
NameBDBM50082711
Synonyms:1-(5-Amino-4,4-diphenyl-pentyl)-4-(4-chloro-phenyl)-piperidin-4-ol | CHEMBL125111
TypeSmall organic molecule
Emp. Form.C28H33ClN2O
Mol. Mass.449.027
SMILESNCC(CCCN1CCC(O)(CC1)c1ccc(Cl)cc1)(c1ccccc1)c1ccccc1