Reaction Details
TargetC-C chemokine receptor type 1
LigandBDBM50082694
Substrate/Competitorn/a
Meas. Tech.ChEMBL_41751 (CHEMBL651702)
Ki 22±n/a nM
Citation Ng, HPMay, KBauman, JGGhannam, AIslam, ILiang, MHoruk, RHesselgesser, JSnider, RMPerez, HDMorrissey, MM Discovery of novel non-peptide CCR1 receptor antagonists. J Med Chem42:4680-94 (1999) C-C chemokine receptor type 1
Name:C-C chemokine receptor type 1
Type:Enzyme
Mol. Mass.:41180.69
Organism:Homo sapiens (Human)
Description:P32246
Residue:355
BDBM50082694
NameBDBM50082694
Synonyms:4-(4-Chloro-phenyl)-1-(4-cyano-4-naphthalen-2-yl-butyl)-4-hydroxy-1-methyl-piperidinium; iodide | CHEMBL143374
TypeSmall organic molecule
Emp. Form.C27H30ClN2O
Mol. Mass.433.992
SMILESC[N+]1(CCCC(C#N)c2ccc3ccccc3c2)CCC(O)(CC1)c1ccc(Cl)cc1