Reaction Details
TargetC-C chemokine receptor type 1
LigandBDBM50082690
Substrate/Competitorn/a
Meas. Tech.ChEMBL_41751 (CHEMBL651702)
Ki 32±n/a nM
Citation Ng, HPMay, KBauman, JGGhannam, AIslam, ILiang, MHoruk, RHesselgesser, JSnider, RMPerez, HDMorrissey, MM Discovery of novel non-peptide CCR1 receptor antagonists. J Med Chem42:4680-94 (1999) C-C chemokine receptor type 1
Name:C-C chemokine receptor type 1
Type:Enzyme
Mol. Mass.:41180.69
Organism:Homo sapiens (Human)
Description:P32246
Residue:355
BDBM50082690
NameBDBM50082690
Synonyms:11-{3-[4-(4-Chloro-phenyl)-4-hydroxy-piperidin-1-yl]-propyl}-5-methyl-6-oxo-6,11-dihydro-5H-dibenzo[b,e]azepine-11-carbonitrile | CHEMBL142925
TypeSmall organic molecule
Emp. Form.C30H30ClN3O2
Mol. Mass.500.031
SMILESCN1c2ccccc2C(CCCN2CCC(O)(CC2)c2ccc(Cl)cc2)(C#N)c2ccccc2C1=O