Reaction Details
TargetC-C chemokine receptor type 1
LigandBDBM50408773
Substrate/Competitorn/a
Meas. Tech.ChEMBL_41751 (CHEMBL651702)
Ki 136±n/a nM
Citation Ng, HPMay, KBauman, JGGhannam, AIslam, ILiang, MHoruk, RHesselgesser, JSnider, RMPerez, HDMorrissey, MM Discovery of novel non-peptide CCR1 receptor antagonists. J Med Chem42:4680-94 (1999) C-C chemokine receptor type 1
Name:C-C chemokine receptor type 1
Type:Enzyme
Mol. Mass.:41180.69
Organism:Homo sapiens (Human)
Description:P32246
Residue:355
BDBM50408773
NameBDBM50408773
Synonyms:CHEMBL2112832
TypeSmall organic molecule
Emp. Form.C28H29FN2O
Mol. Mass.428.5411
SMILESOC1(CCN(CCCC(C#N)(c2ccccc2)c2ccccc2)CC1)c1ccc(F)cc1