Reaction Details
TargetAlpha-1D adrenergic receptor
LigandBDBM50082793
Substrate/Competitorn/a
Meas. Tech.ChEMBL_32451 (CHEMBL643399)
Ki 2600±n/a nM
Citation Nagarathnam, DMiao, SWLagu, BChiu, GFang, JMurali Dhar, TGZhang, JTyagarajan, SMarzabadi, MRZhang, FWong, WCSun, WTian, DWetzel, JMForray, CChang, RSBroten, TPRansom, RWSchorn, TWChen, TBO'Malley, SKling, PSchneck, KBendesky, RHarrell, CM Design and synthesis of novel alpha(1)(a) adrenoceptor-selective antagonists. 1. Structure-activity relationship in dihydropyrimidinones. J Med Chem42:4764-77 (1999) Alpha-1D adrenergic receptor
Name:Alpha-1D adrenergic receptor
Type:Enzyme Catalytic Domain
Mol. Mass.:60485.82
Organism:Homo sapiens (Human)
Description:adrenergic Alpha1D ADRA1D HUMAN::P25100
Residue:572
BDBM50082793
NameBDBM50082793
Synonyms:3-[3-(4-Methoxycarbonyl-4-phenyl-piperidin-1-yl)-propylcarbamoyl]-6-methyl-4-(4-nitro-phenyl)-2-oxo-1,2,3,4-tetrahydro-pyrimidine-5-carboxylic acid | CHEMBL145267
TypeSmall organic molecule
Emp. Form.C29H33N5O8
Mol. Mass.579.601
SMILESCOC(=O)C1(CCN(CCCNC(=O)N2C(C(C(O)=O)=C(C)NC2=O)c2ccc(cc2)[N+]([O-])=O)CC1)c1ccccc1