Reaction Details
TargetAlpha-1A adrenergic receptor
LigandBDBM50082784
Substrate/Competitorn/a
Meas. Tech.ChEMBL_33738 (CHEMBL647054)
Ki 0.21±n/a nM
Citation Nagarathnam, DMiao, SWLagu, BChiu, GFang, JMurali Dhar, TGZhang, JTyagarajan, SMarzabadi, MRZhang, FWong, WCSun, WTian, DWetzel, JMForray, CChang, RSBroten, TPRansom, RWSchorn, TWChen, TBO'Malley, SKling, PSchneck, KBendesky, RHarrell, CM Design and synthesis of novel alpha(1)(a) adrenoceptor-selective antagonists. 1. Structure-activity relationship in dihydropyrimidinones. J Med Chem42:4764-77 (1999) Alpha-1A adrenergic receptor
Name:Alpha-1A adrenergic receptor
Type:Cell-surface receptors
Mol. Mass.:51511.67
Organism:Homo sapiens (Human)
Description:P35348
Residue:466
BDBM50082784
NameBDBM50082784
Synonyms:1-(3-{[5-Carbamoyl-6-(3,4-difluoro-phenyl)-4-ethyl-2-oxo-3,6-dihydro-2H-pyrimidine-1-carbonyl]-amino}-propyl)-4-phenyl-piperidine-4-carboxylic acid methyl ester | CHEMBL356584
TypeSmall organic molecule
Emp. Form.C30H35F2N5O5
Mol. Mass.583.6262
SMILESCCC1=C(C(N(C(=O)NCCCN2CCC(CC2)(C(=O)OC)c2ccccc2)C(=O)N1)c1ccc(F)c(F)c1)C(N)=O