Reaction Details
TargetAlpha-1A adrenergic receptor
LigandBDBM50082790
Substrate/Competitorn/a
Meas. Tech.ChEMBL_34030 (CHEMBL646169)
Ki 0.58±n/a nM
Citation Nagarathnam, DMiao, SWLagu, BChiu, GFang, JMurali Dhar, TGZhang, JTyagarajan, SMarzabadi, MRZhang, FWong, WCSun, WTian, DWetzel, JMForray, CChang, RSBroten, TPRansom, RWSchorn, TWChen, TBO'Malley, SKling, PSchneck, KBendesky, RHarrell, CM Design and synthesis of novel alpha(1)(a) adrenoceptor-selective antagonists. 1. Structure-activity relationship in dihydropyrimidinones. J Med Chem42:4764-77 (1999) Alpha-1A adrenergic receptor
Name:Alpha-1A adrenergic receptor
Type:Protein
Mol. Mass.:51620.15
Organism:Rattus norvegicus (Rat)
Description:P43140
Residue:466
BDBM50082790
NameBDBM50082790
Synonyms:1-(3-{[5-Carbamoyl-4-ethyl-6-(4-nitro-phenyl)-2-oxo-3,6-dihydro-2H-pyrimidine-1-carbonyl]-amino}-propyl)-4-phenyl-piperidine-4-carboxylic acid methyl ester | CHEMBL358595
TypeSmall organic molecule
Emp. Form.C30H36N6O7
Mol. Mass.592.6428
SMILESCCC1=C(C(N(C(=O)NCCCN2CCC(CC2)(C(=O)OC)c2ccccc2)C(=O)N1)c1ccc(cc1)[N+]([O-])=O)C(N)=O