Reaction Details
TargetAlpha-1B adrenergic receptor
LigandBDBM50082801
Substrate/Competitorn/a
Meas. Tech.ChEMBL_34457 (CHEMBL651989)
Ki 15±n/a nM
Citation Nagarathnam, DMiao, SWLagu, BChiu, GFang, JMurali Dhar, TGZhang, JTyagarajan, SMarzabadi, MRZhang, FWong, WCSun, WTian, DWetzel, JMForray, CChang, RSBroten, TPRansom, RWSchorn, TWChen, TBO'Malley, SKling, PSchneck, KBendesky, RHarrell, CM Design and synthesis of novel alpha(1)(a) adrenoceptor-selective antagonists. 1. Structure-activity relationship in dihydropyrimidinones. J Med Chem42:4764-77 (1999) Alpha-1B adrenergic receptor
Name:Alpha-1B adrenergic receptor
Type:Enzyme
Mol. Mass.:56862.13
Organism:Homo sapiens (Human)
Description:P35368
Residue:520
BDBM50082801
NameBDBM50082801
Synonyms:3-[3-(4-Methoxycarbonyl-4-phenyl-piperidin-1-yl)-propylcarbamoyl]-6-methyl-4-(4-nitro-phenyl)-2-oxo-1,2,3,4-tetrahydro-pyrimidine-5-carboxylic acid ethyl ester | CHEMBL142957
TypeSmall organic molecule
Emp. Form.C31H37N5O8
Mol. Mass.607.6542
SMILESCCOC(=O)C1=C(C)NC(=O)N(C1c1ccc(cc1)[N+]([O-])=O)C(=O)NCCCN1CCC(CC1)(C(=O)OC)c1ccccc1