Reaction Details
TargetAlpha-1B adrenergic receptor
LigandBDBM50082874
Substrate/Competitorn/a
Meas. Tech.ChEMBL_34328 (CHEMBL648111)
Ki 240±n/a nM
Citation Wong, WCSun, WLagu, BTian, DMarzabadi, MRZhang, FNagarathnam, DMiao, SWWetzel, JMPeng, JForray, CChang, RSChen, TBRansom, RO'Malley, SBroten, TPKling, PVyas, KPZhang, KGluchowski, C Design and synthesis of novel alpha(1)(a) adrenoceptor-selective antagonists. 4. Structure-activity relationship in the dihydropyrimidine series. J Med Chem42:4804-13 (1999) Alpha-1B adrenergic receptor
Name:Alpha-1B adrenergic receptor
Type:Enzyme
Mol. Mass.:56862.13
Organism:Homo sapiens (Human)
Description:P35368
Residue:520
BDBM50082874
NameBDBM50082874
Synonyms:1-{5-[4-(2-Carbamoyl-phenyl)-piperazin-1-yl]-pentyl}-6-(3,4-difluoro-phenyl)-2,4-dimethyl-1,6-dihydro-pyrimidine-5-carboxylic acid methyl ester | CHEMBL357828
TypeSmall organic molecule
Emp. Form.C30H37F2N5O3
Mol. Mass.553.6433
SMILESCOC(=O)C1=C(C)N=C(C)N(CCCCCN2CCN(CC2)c2ccccc2C(N)=O)C1c1ccc(F)c(F)c1