Reaction Details
TargetAlpha-1B adrenergic receptor
LigandBDBM50082880
Substrate/Competitorn/a
Meas. Tech.ChEMBL_34328 (CHEMBL648111)
Ki 250±n/a nM
Citation Wong, WCSun, WLagu, BTian, DMarzabadi, MRZhang, FNagarathnam, DMiao, SWWetzel, JMPeng, JForray, CChang, RSChen, TBRansom, RO'Malley, SBroten, TPKling, PVyas, KPZhang, KGluchowski, C Design and synthesis of novel alpha(1)(a) adrenoceptor-selective antagonists. 4. Structure-activity relationship in the dihydropyrimidine series. J Med Chem42:4804-13 (1999) Alpha-1B adrenergic receptor
Name:Alpha-1B adrenergic receptor
Type:Enzyme
Mol. Mass.:56862.13
Organism:Homo sapiens (Human)
Description:P35368
Residue:520
BDBM50082880
NameBDBM50082880
Synonyms:6-(3,4-Difluoro-phenyl)-2,4-dimethyl-1-[5-(4-o-tolyl-4-p-tolyl-piperidin-1-yl)-pentyl]-1,6-dihydro-pyrimidine-5-carboxylic acid methyl ester | CHEMBL145411
TypeSmall organic molecule
Emp. Form.C38H45F2N3O2
Mol. Mass.613.7796
SMILESCOC(=O)C1=C(C)N=C(C)N(CCCCCN2CCC(CC2)(c2ccc(C)cc2)c2ccccc2C)C1c1ccc(F)c(F)c1