Reaction Details
TargetAlpha-1D adrenergic receptor
LigandBDBM50082825
Substrate/Competitorn/a
Meas. Tech.ChEMBL_32430 (CHEMBL646092)
Ki 150±n/a nM
Citation Wong, WCSun, WLagu, BTian, DMarzabadi, MRZhang, FNagarathnam, DMiao, SWWetzel, JMPeng, JForray, CChang, RSChen, TBRansom, RO'Malley, SBroten, TPKling, PVyas, KPZhang, KGluchowski, C Design and synthesis of novel alpha(1)(a) adrenoceptor-selective antagonists. 4. Structure-activity relationship in the dihydropyrimidine series. J Med Chem42:4804-13 (1999) Alpha-1D adrenergic receptor
Name:Alpha-1D adrenergic receptor
Type:Enzyme Catalytic Domain
Mol. Mass.:60485.82
Organism:Homo sapiens (Human)
Description:adrenergic Alpha1D ADRA1D HUMAN::P25100
Residue:572
BDBM50082825
NameBDBM50082825
Synonyms:4-(3,4-Difluoro-phenyl)-3-[5-(4-methoxycarbonyl-4-phenyl-piperidin-1-yl)-pentyl]-6-methyl-2-oxo-1,2,3,4-tetrahydro-pyrimidine-5-carboxylic acid methyl ester | CHEMBL142981
TypeSmall organic molecule
Emp. Form.C31H37F2N3O5
Mol. Mass.569.6394
SMILESCOC(=O)C1C(N(CCCCCN2CCC(CC2)(C(=O)OC)c2ccccc2)C(=O)N=C1C)c1ccc(F)c(F)c1