Reaction Details
TargetAlpha-1A adrenergic receptor
LigandBDBM50082883
Substrate/Competitorn/a
Meas. Tech.ChEMBL_33605 (CHEMBL876765)
Ki 6.8±n/a nM
Citation Wong, WCSun, WLagu, BTian, DMarzabadi, MRZhang, FNagarathnam, DMiao, SWWetzel, JMPeng, JForray, CChang, RSChen, TBRansom, RO'Malley, SBroten, TPKling, PVyas, KPZhang, KGluchowski, C Design and synthesis of novel alpha(1)(a) adrenoceptor-selective antagonists. 4. Structure-activity relationship in the dihydropyrimidine series. J Med Chem42:4804-13 (1999) Alpha-1A adrenergic receptor
Name:Alpha-1A adrenergic receptor
Type:Cell-surface receptors
Mol. Mass.:51511.67
Organism:Homo sapiens (Human)
Description:P35348
Residue:466
BDBM50082883
NameBDBM50082883
Synonyms:6-(3,4-Difluoro-phenyl)-1-[3-(4-methoxycarbonyl-4-phenyl-piperidin-1-ylmethyl)-benzyl]-2,4-dimethyl-1,6-dihydro-pyrimidine-5-carboxylic acid methyl ester | CHEMBL144731
TypeSmall organic molecule
Emp. Form.C35H37F2N3O4
Mol. Mass.601.6828
SMILESCOC(=O)C1=C(C)N=C(C)N(Cc2cccc(CN3CCC(CC3)(C(=O)OC)c3ccccc3)c2)C1c1ccc(F)c(F)c1