Reaction Details
TargetAlpha-1B adrenergic receptor
LigandBDBM50082879
Substrate/Competitorn/a
Meas. Tech.ChEMBL_34328 (CHEMBL648111)
Ki 310±n/a nM
Citation Wong, WCSun, WLagu, BTian, DMarzabadi, MRZhang, FNagarathnam, DMiao, SWWetzel, JMPeng, JForray, CChang, RSChen, TBRansom, RO'Malley, SBroten, TPKling, PVyas, KPZhang, KGluchowski, C Design and synthesis of novel alpha(1)(a) adrenoceptor-selective antagonists. 4. Structure-activity relationship in the dihydropyrimidine series. J Med Chem42:4804-13 (1999) Alpha-1B adrenergic receptor
Name:Alpha-1B adrenergic receptor
Type:Enzyme
Mol. Mass.:56862.13
Organism:Homo sapiens (Human)
Description:P35368
Residue:520
BDBM50082879
NameBDBM50082879
Synonyms:1-[5-(4-Cyano-4-phenyl-piperidin-1-yl)-pentyl]-6-(3,4-difluoro-phenyl)-2-methoxymethyl-4-methyl-1,6-dihydro-pyrimidine-5-carboxylic acid methyl ester | CHEMBL144534
TypeSmall organic molecule
Emp. Form.C32H38F2N4O3
Mol. Mass.564.6659
SMILESCOCC1=NC(C)=C(C(N1CCCCCN1CCC(CC1)(C#N)c1ccccc1)c1ccc(F)c(F)c1)C(=O)OC