Reaction Details
TargetAlpha-1A adrenergic receptor
LigandBDBM50082884
Substrate/Competitorn/a
Meas. Tech.ChEMBL_33605 (CHEMBL876765)
Ki 3.5±n/a nM
Citation Wong, WCSun, WLagu, BTian, DMarzabadi, MRZhang, FNagarathnam, DMiao, SWWetzel, JMPeng, JForray, CChang, RSChen, TBRansom, RO'Malley, SBroten, TPKling, PVyas, KPZhang, KGluchowski, C Design and synthesis of novel alpha(1)(a) adrenoceptor-selective antagonists. 4. Structure-activity relationship in the dihydropyrimidine series. J Med Chem42:4804-13 (1999) Alpha-1A adrenergic receptor
Name:Alpha-1A adrenergic receptor
Type:Cell-surface receptors
Mol. Mass.:51511.67
Organism:Homo sapiens (Human)
Description:P35348
Residue:466
BDBM50082884
NameBDBM50082884
Synonyms:1-{(S)-5-[4-(2-Carbamoyl-phenyl)-piperazin-1-yl]-4-methyl-pentyl}-6-(3,4-difluoro-phenyl)-2,4-dimethyl-1,6-dihydro-pyrimidine-5-carboxylic acid methyl ester | CHEMBL358313
TypeSmall organic molecule
Emp. Form.C31H39F2N5O3
Mol. Mass.567.6699
SMILESCOC(=O)C1=C(C)N=C(C)N(CCC[C@H](C)CN2CCN(CC2)c2ccccc2C(N)=O)C1c1ccc(F)c(F)c1