Reaction Details
TargetNeuraminidase
LigandBDBM50083321
Substrate/Competitorn/a
Meas. Tech.ChEMBL_144589 (CHEMBL749506)
Ki 1690±n/a nM
Citation Wall, IDLeach, ARSalt, DWFord, MGEssex, JW Binding constants of neuraminidase inhibitors: An investigation of the linear interaction energy method. J Med Chem42:5142-52 (2000) Neuraminidase
Name:Neuraminidase
Type:Enzyme
Mol. Mass.:50124.14
Organism:Influenza A virus (A/Puerto Rico/8/34/Mount Sinai(H1N1))
Description:P03468
Residue:454
BDBM50083321
NameBDBM50083321
Synonyms:3-Acetylamino-6-dihydroxymethyl-2-ethylcarbamoyl-3,4-dihydro-2H-pyran-4-yl-ammonium
TypeSmall organic molecule
Emp. Form.C11H20N3O5
Mol. Mass.274.2931
SMILESCCNC(=O)[C@@H]1OC(=C[C@H]([NH3+])[C@H]1NC(C)=O)C(O)O