Reaction Details
TargetNeuraminidase
LigandBDBM50083328
Substrate/Competitorn/a
Meas. Tech.ChEMBL_144589 (CHEMBL749506)
Ki 3.3±n/a nM
Citation Wall, IDLeach, ARSalt, DWFord, MGEssex, JW Binding constants of neuraminidase inhibitors: An investigation of the linear interaction energy method. J Med Chem42:5142-52 (2000) Neuraminidase
Name:Neuraminidase
Type:Enzyme
Mol. Mass.:50124.14
Organism:Influenza A virus (A/Puerto Rico/8/34/Mount Sinai(H1N1))
Description:P03468
Residue:454
BDBM50083328
NameBDBM50083328
Synonyms:3-Acetylamino-6-dihydroxymethyl-4-guanidino-3,4-dihydro-2H-pyran-2-carboxylic acid dimethylamide | CHEMBL146862
TypeSmall organic molecule
Emp. Form.C12H21N5O5
Mol. Mass.315.3256
SMILES[#6]-[#7](-[#6])-[#6](=O)-[#6@@H]-1-[#8]-[#6](=[#6]-[#6@H](\[#7]=[#6](\[#7])-[#7])-[#6@H]-1-[#7]-[#6](-[#6])=O)-[#6](-[#8])-[#8]