Reaction Details
TargetAcetylcholinesterase
LigandBDBM8960
Substrate/Competitorn/a
Meas. Tech.ChEMBL_28139 (CHEMBL644923)
IC50 48±n/a nM
Citation Contreras, JMRival, YMChayer, SBourguignon, JJWermuth, CG Aminopyridazines as acetylcholinesterase inhibitors. J Med Chem42:730-41 (1999) 
 
Acetylcholinesterase
Name:Acetylcholinesterase
Type:n/a
Mol. Mass.:65900.74
Organism:Tetronarce californica (Pacific electric ray) (Torpedo californica)
Description:P04058
Residue:586
BDBM8960
NameBDBM8960
Synonyms:(+/-)-2-[(1-benzylpiperidin-4-yl)methyl]-5,6-dimethoxy-indan-1-one Aricept CHEMBL1678 CHEMBL502 Donepezil E2020 US9346818, DPH US9663465, Donepezil
TypeSmall organic molecule
Emp. Form.C24H29NO3
Mol. Mass.379.492
SMILESCOc1cc2CC(CC3CCN(Cc4ccccc4)CC3)C(=O)c2cc1OC