Reaction Details
TargetcGMP-specific 3',5'-cyclic phosphodiesterase
LigandBDBM50074897
Substrate/Competitorn/a
Meas. Tech.ChEMBL_155195 (CHEMBL763668)
IC50 800±n/a nM
Citation Ukita, TSugahara, MTerakawa, YKuroda, TWada, KNakata, AOhmachi, YKikkawa, HIkezawa, KNaito, K Novel, potent, and selective phosphodiesterase-4 inhibitors as antiasthmatic agents: synthesis and biological activities of a series of 1-pyridylnaphthalene derivatives. J Med Chem42:1088-99 (1999) 
 
cGMP-specific 3',5'-cyclic phosphodiesterase
Name:cGMP-specific 3',5'-cyclic phosphodiesterase
Type:Protein
Mol. Mass.:99975.83
Organism:Homo sapiens (Human)
Description:O76074
Residue:875
BDBM50074897
NameBDBM50074897
Synonyms:2-[4-(7-Ethoxy-2,3-bis-hydroxymethyl-6-methoxy-naphthalen-1-yl)-pyridin-2-yl]-4-pyridin-3-yl-2H-phthalazin-1-one; hydrochloride | CHEMBL552877
TypeSmall organic molecule
Emp. Form.C33H28N4O5
Mol. Mass.560.5992
SMILESCCOc1cc2c(-c3ccnc(c3)-n3nc(-c4cccnc4)c4ccccc4c3=O)c(CO)c(CO)cc2cc1OC