Reaction Details
TargetcGMP-specific 3',5'-cyclic phosphodiesterase
LigandBDBM50074886
Substrate/Competitorn/a
Meas. Tech.ChEMBL_155195 (CHEMBL763668)
IC50 4000±n/a nM
Citation Ukita, TSugahara, MTerakawa, YKuroda, TWada, KNakata, AOhmachi, YKikkawa, HIkezawa, KNaito, K Novel, potent, and selective phosphodiesterase-4 inhibitors as antiasthmatic agents: synthesis and biological activities of a series of 1-pyridylnaphthalene derivatives. J Med Chem42:1088-99 (1999) 
 
cGMP-specific 3',5'-cyclic phosphodiesterase
Name:cGMP-specific 3',5'-cyclic phosphodiesterase
Type:Protein
Mol. Mass.:99975.83
Organism:Homo sapiens (Human)
Description:O76074
Residue:875
BDBM50074886
NameBDBM50074886
Synonyms:2-[4-(2,3-Bis-hydroxymethyl-6,7-dimethoxy-naphthalen-1-yl)-pyridin-2-yl]-4-pyridin-4-yl-2H-phthalazin-1-one; hydrochloride | CHEMBL552876
TypeSmall organic molecule
Emp. Form.C32H26N4O5
Mol. Mass.546.5726
SMILESCOc1cc2cc(CO)c(CO)c(-c3ccnc(c3)-n3nc(-c4ccncc4)c4ccccc4c3=O)c2cc1OC