Reaction Details
TargetDual specificity calcium/calmodulin-dependent 3',5'-cyclic nucleotide phosphodiesterase 1A/1B/1C
LigandBDBM50074884
Substrate/Competitorn/a
Meas. Tech.ChEMBL_156148 (CHEMBL760754)
IC50 5000±n/a nM
Citation Ukita, TSugahara, MTerakawa, YKuroda, TWada, KNakata, AOhmachi, YKikkawa, HIkezawa, KNaito, K Novel, potent, and selective phosphodiesterase-4 inhibitors as antiasthmatic agents: synthesis and biological activities of a series of 1-pyridylnaphthalene derivatives. J Med Chem42:1088-99 (1999) 
 
Dual specificity calcium/calmodulin-dependent 3',5'-cyclic nucleotide phosphodiesterase 1A/1B/1C
Name:Dual specificity calcium/calmodulin-dependent 3',5'-cyclic nucleotide phosphodiesterase 1A/1B/1C
Synonyms:Phosphodiesterase 1
Type:n/a
Mol. Mass.:n/a
Description:Combinations of UniProts
Components:This complex has 3 components.
Component 1
Name:Dual specificity calcium/calmodulin-dependent 3',5'-cyclic nucleotide phosphodiesterase 1C
Type:Enzyme
Mol. Mass.:80778.58
Organism:Homo sapiens (Human)
Description:Q14123
Residue:709
Component 2
Name:Dual specificity calcium/calmodulin-dependent 3',5'-cyclic nucleotide phosphodiesterase 1A
Synonyms:61 kDa Cam-PDE Cam-PDE 1A PDE1A_HUMAN | hCam-1
Type:Protein
Mol. Mass.:61245.69
Organism:Homo sapiens (Human)
Description:P54750
Residue:535
Component 3
Name:Dual specificity calcium/calmodulin-dependent 3',5'-cyclic nucleotide phosphodiesterase 1B
Synonyms:63 kDa Cam-PDE Calcium/calmodulin-dependent 3',5'-cyclic nucleotide phosphodiesterase 1B PDE1B PDE1B_HUMAN Phosphodiesterase 1B Phosphodiesterase Type 1 (PDE1B) | Phosphodiesterase, PDE1/PDE5
Type:Enzyme
Mol. Mass.:61366.51
Organism:Homo sapiens (Human)
Description:n/a
Residue:536
BDBM50074884
NameBDBM50074884
Synonyms:2-[4-(2,3-Bis-hydroxymethyl-6,7-dimethoxy-naphthalen-1-yl)-pyridin-2-yl]-2H-phthalazin-1-one | CHEMBL12412
TypeSmall organic molecule
Emp. Form.C27H23N3O5
Mol. Mass.469.4886
SMILESCOc1cc2cc(CO)c(CO)c(-c3ccnc(c3)-n3ncc4ccccc4c3=O)c2cc1OC