Reaction Details
TargetAdenosine receptor A3
LigandBDBM50369514
Substrate/Competitorn/a
Meas. Tech.ChEMBL_30488 (CHEMBL642102)
Ki 0.33±n/a nM
Citation van Tilburg, EWvon Frijtag Drabbe Künzel, Jde Groote, MVollinga, RCLorenzen, AIJzerman, AP N6,5'-Disubstituted adenosine derivatives as partial agonists for the human adenosine A3 receptor. J Med Chem42:1393-400 (1999) 
 
Adenosine receptor A3
Name:Adenosine receptor A3
Type:G Protein-Coupled Receptor (GPCR)
Mol. Mass.:36197.32
Organism:Homo sapiens (Human)
Description:P0DMS8
Residue:318
BDBM50369514
NameBDBM50369514
Synonyms:CHEMBL605266
TypeSmall organic molecule
Emp. Form.C19H20ClIN6O4
Mol. Mass.558.757
SMILESCNC(=O)C[C@H]1OC([C@@H](O)[C@H]1O)n1cnc2c(NCc3cccc(I)c3)nc(Cl)nc12