Reaction Details
TargetP2Y purinoceptor 1
LigandBDBM50076457
Substrate/Competitorn/a
Meas. Tech.ChEMBL_147722 (CHEMBL759192)
IC50 19600±n/a nM
Citation Nandanan, ECamaioni, EJang, SYKim, YCCristalli, GHerdewijn, PSecrist, JATiwari, KNMohanram, AHarden, TKBoyer, JLJacobson, KA Structure-activity relationships of bisphosphate nucleotide derivatives as P2Y1 receptor antagonists and partial agonists. J Med Chem42:1625-38 (1999) 
 
P2Y purinoceptor 1
Name:P2Y purinoceptor 1
Type:n/a
Mol. Mass.:41199.64
Organism:Meleagris gallopavo
Description:n/a
Residue:362
BDBM50076457
NameBDBM50076457
Synonyms:CHEMBL42554 | [5-(6-Amino-purin-9-yl)-3-phosphonooxy-tetrahydro-furan-2-ylmethoxymethyl]-phosphonic acid
TypeSmall organic molecule
Emp. Form.C11H17N5O9P2
Mol. Mass.425.2283
SMILESNc1ncnc2n(cnc12)C1CC(OP(O)(O)=O)C(COCP(O)(O)=O)O1