Reaction Details
TargetP2Y purinoceptor 1
LigandBDBM50076464
Substrate/Competitorn/a
Meas. Tech.ChEMBL_147722 (CHEMBL759192)
IC50 1850±n/a nM
Citation Nandanan, ECamaioni, EJang, SYKim, YCCristalli, GHerdewijn, PSecrist, JATiwari, KNMohanram, AHarden, TKBoyer, JLJacobson, KA Structure-activity relationships of bisphosphate nucleotide derivatives as P2Y1 receptor antagonists and partial agonists. J Med Chem42:1625-38 (1999) 
 
P2Y purinoceptor 1
Name:P2Y purinoceptor 1
Type:n/a
Mol. Mass.:41199.64
Organism:Meleagris gallopavo
Description:n/a
Residue:362
BDBM50076464
NameBDBM50076464
Synonyms:CHEMBL43507 | Phosphoric acid mono-[5-(2-amino-6-methylamino-purin-9-yl)-2-phosphonooxymethyl-tetrahydro-furan-3-yl] ester
TypeSmall organic molecule
Emp. Form.C11H18N6O9P2
Mol. Mass.440.2429
SMILESCNc1nc(N)nc2n(cnc12)C1CC(OP(O)(O)=O)C(COP(O)(O)=O)O1