Reaction Details
TargetP2Y purinoceptor 1
LigandBDBM50076468
Substrate/Competitorn/a
Meas. Tech.ChEMBL_147722 (CHEMBL759192)
IC50 30700±n/a nM
Citation Nandanan, ECamaioni, EJang, SYKim, YCCristalli, GHerdewijn, PSecrist, JATiwari, KNMohanram, AHarden, TKBoyer, JLJacobson, KA Structure-activity relationships of bisphosphate nucleotide derivatives as P2Y1 receptor antagonists and partial agonists. J Med Chem42:1625-38 (1999) 
 
P2Y purinoceptor 1
Name:P2Y purinoceptor 1
Type:n/a
Mol. Mass.:41199.64
Organism:Meleagris gallopavo
Description:n/a
Residue:362
BDBM50076468
NameBDBM50076468
Synonyms:CHEMBL295562 | Phosphoric acid mono-[5-(6-amino-8-vinyl-purin-9-yl)-2-phosphonooxymethyl-tetrahydro-furan-3-yl] ester
TypeSmall organic molecule
Emp. Form.C12H17N5O9P2
Mol. Mass.437.239
SMILESNc1ncnc2n(C3CC(OP(O)(O)=O)C(COP(O)(O)=O)O3)c(C=C)nc12