Reaction Details
TargetP2Y purinoceptor 1
LigandBDBM50076471
Substrate/Competitorn/a
Meas. Tech.ChEMBL_147715 (CHEMBL759185)
EC50 1710±n/a nM
Citation Nandanan, ECamaioni, EJang, SYKim, YCCristalli, GHerdewijn, PSecrist, JATiwari, KNMohanram, AHarden, TKBoyer, JLJacobson, KA Structure-activity relationships of bisphosphate nucleotide derivatives as P2Y1 receptor antagonists and partial agonists. J Med Chem42:1625-38 (1999) 
 
P2Y purinoceptor 1
Name:P2Y purinoceptor 1
Type:n/a
Mol. Mass.:41199.64
Organism:Meleagris gallopavo
Description:n/a
Residue:362
BDBM50076471
NameBDBM50076471
Synonyms:CHEMBL289949 | Phosphoric acid mono-[5-(6-amino-2-propylsulfanyl-purin-9-yl)-2-phosphonooxymethyl-tetrahydro-furan-3-yl] ester
TypeSmall organic molecule
Emp. Form.C13H21N5O9P2S
Mol. Mass.485.346
SMILESCCCSc1nc(N)c2ncn(C3CC(OP(O)(O)=O)C(COP(O)(O)=O)O3)c2n1