Reaction Details
TargetP2Y purinoceptor 1
LigandBDBM50076455
Substrate/Competitorn/a
Meas. Tech.ChEMBL_147722 (CHEMBL759192)
IC50 2530±n/a nM
Citation Nandanan, ECamaioni, EJang, SYKim, YCCristalli, GHerdewijn, PSecrist, JATiwari, KNMohanram, AHarden, TKBoyer, JLJacobson, KA Structure-activity relationships of bisphosphate nucleotide derivatives as P2Y1 receptor antagonists and partial agonists. J Med Chem42:1625-38 (1999) 
 
P2Y purinoceptor 1
Name:P2Y purinoceptor 1
Type:n/a
Mol. Mass.:41199.64
Organism:Meleagris gallopavo
Description:n/a
Residue:362
BDBM50076455
NameBDBM50076455
Synonyms:CHEMBL43903 | Phosphoric acid mono-[4-(6-amino-purin-9-yl)-2-phosphonooxymethyl-cyclopentyl] ester
TypeSmall organic molecule
Emp. Form.C11H17N5O8P2
Mol. Mass.409.2289
SMILESNc1ncnc2n(cnc12)C1CC(COP(O)(O)=O)C(C1)OP(O)(O)=O