Reaction Details
TargetP2Y purinoceptor 1
LigandBDBM50076474
Substrate/Competitorn/a
Meas. Tech.ChEMBL_147715 (CHEMBL759185)
EC50 2990±n/a nM
Citation Nandanan, ECamaioni, EJang, SYKim, YCCristalli, GHerdewijn, PSecrist, JATiwari, KNMohanram, AHarden, TKBoyer, JLJacobson, KA Structure-activity relationships of bisphosphate nucleotide derivatives as P2Y1 receptor antagonists and partial agonists. J Med Chem42:1625-38 (1999) 
 
P2Y purinoceptor 1
Name:P2Y purinoceptor 1
Type:n/a
Mol. Mass.:41199.64
Organism:Meleagris gallopavo
Description:n/a
Residue:362
BDBM50076474
NameBDBM50076474
Synonyms:CHEMBL416252 | Phosphoric acid mono-[5-(6-amino-purin-9-yl)-2-phosphonooxymethyl-tetrahydro-pyran-3-yl] ester
TypeSmall organic molecule
Emp. Form.C11H17N5O9P2
Mol. Mass.425.2283
SMILESNc1ncnc2n(cnc12)C1COC(COP(O)(O)=O)C(C1)OP(O)(O)=O