Reaction Details
TargetGamma-aminobutyric acid receptor subunit alpha-6/beta-3/gamma-2
LigandBDBM50044941
Substrate/Competitorn/a
Meas. Tech.ChEMBL_68433 (CHEMBL683045)
Ki 5.3±n/a nM
Citation Huang, QHe, XMa, CLiu, RYu, SDayer, CAWenger, GRMcKernan, RCook, JM Pharmacophore/receptor models for GABA(A)/BzR subtypes (alpha1beta3gamma2, alpha5beta3gamma2, and alpha6beta3gamma2) via a comprehensive ligand-mapping approach. J Med Chem43:71-95 (2000) Gamma-aminobutyric acid receptor subunit alpha-6/beta-3/gamma-2
Name:Gamma-aminobutyric acid receptor subunit alpha-6/beta-3/gamma-2
Type:n/a
Mol. Mass.:n/a
Description:ASSAY_ID of EBI is 68432
Components:This complex has 3 components.
Component 1
Name:Gamma-aminobutyric acid receptor subunit gamma-2
Synonyms:GABA(A) receptor subunit gamma-2 GBRG2_HUMAN
Type:PROTEIN
Mol. Mass.:54172.74
Organism:Homo sapiens (Human)
Description:EBI_217
Residue:467
Component 2
Name:Gamma-aminobutyric acid receptor subunit alpha-6
Synonyms:GABA A alpha6 GABRA6 | GBRA6_HUMAN
Type:Enzyme Catalytic Domain
Mol. Mass.:51029.60
Organism:Homo sapiens (Human)
Description:GABA A alpha6 0 HUMAN::Q16445
Residue:453
Component 3
Name:Gamma-aminobutyric acid receptor subunit beta-3
Synonyms:GABA A receptor alpha-4/beta-3/gamma-2 GABA-A receptor GBRB3_HUMAN | agonist GABA site
Type:PROTEIN
Mol. Mass.:54130.51
Organism:Homo sapiens (Human)
Description:ChEMBL_448071
Residue:473
BDBM50044941
NameBDBM50044941
Synonyms:8-Azido-5-methyl-6-oxo-5,6-dihydro-4H-2,5,10b-triaza-benzo[e]azulene-3-carboxylic acid tert-butyl ester ZG 234
TypeSmall organic molecule
Emp. Form.C17H18N6O3
Mol. Mass.354.3632
SMILESCN1Cc2c(ncn2-c2ccc(cc2C1=O)N=[N+]=[N-])C(=O)OC(C)(C)C