Reaction Details
TargetIntegrase
LigandBDBM50088351
Substrate/Competitorn/a
Meas. Tech.ChEMBL_88616 (CHEMBL701720)
IC50 19700±n/a nM
Citation Carlson, HAMasukawa, KMRubins, KBushman, FDJorgensen, WLLins, RDBriggs, JMMcCammon, JA Developing a dynamic pharmacophore model for HIV-1 integrase. J Med Chem43:2100-14 (2000) Integrase
Name:Integrase
Synonyms:Human immunodeficiency virus type 1 integrase
Type:PROTEIN
Mol. Mass.:32231.48
Organism:Human immunodeficiency virus 1
Description:ChEMBL_90865
Residue:288
BDBM50088351
NameBDBM50088351
TypeSmall organic molecule
Emp. Form.C51H65N5O14
Mol. Mass.972.0869
SMILESCOC1\C=C\OC2(C)Oc3c(C2=O)c2c(O)c(C=NN4C(C)CN(Cc5ccc(cc5)[N+]([O-])=O)CC4C)c(NC(=O)\C(C)=C/C=C/C(C)C(O)C(C)C(O)C(C)C(OC(C)=O)C1C)c(O)c2c(O)c3C