Reaction Details
TargetIntegrase
LigandBDBM50088356
Substrate/Competitorn/a
Meas. Tech.ChEMBL_88615 (CHEMBL701719)
IC50 680±n/a nM
Citation Carlson, HAMasukawa, KMRubins, KBushman, FDJorgensen, WLLins, RDBriggs, JMMcCammon, JA Developing a dynamic pharmacophore model for HIV-1 integrase. J Med Chem43:2100-14 (2000) Integrase
Name:Integrase
Synonyms:Human immunodeficiency virus type 1 integrase
Type:PROTEIN
Mol. Mass.:32231.48
Organism:Human immunodeficiency virus 1
Description:ChEMBL_90865
Residue:288
BDBM50088356
NameBDBM50088356
TypeSmall organic molecule
Emp. Form.C25H24O12
Mol. Mass.516.4509
SMILESOC1CC(CC(OC(=O)\C=C/c2ccc(O)c(O)c2)C1O)(OC(=O)\C=C/c1ccc(O)c(O)c1)C(O)=O