Reaction Details
TargetIntegrase
LigandBDBM50088355
Substrate/Competitorn/a
Meas. Tech.ChEMBL_88615 (CHEMBL701719)
IC50 2300±n/a nM
Citation Carlson, HAMasukawa, KMRubins, KBushman, FDJorgensen, WLLins, RDBriggs, JMMcCammon, JA Developing a dynamic pharmacophore model for HIV-1 integrase. J Med Chem43:2100-14 (2000) Integrase
Name:Integrase
Synonyms:Human immunodeficiency virus type 1 integrase
Type:PROTEIN
Mol. Mass.:32231.48
Organism:Human immunodeficiency virus 1
Description:ChEMBL_90865
Residue:288
BDBM50088355
NameBDBM50088355
TypeSmall organic molecule
Emp. Form.C26H27NO11
Mol. Mass.529.4927
SMILESC[C@@H]1O[C@H](C[C@H](N)[C@@H]1O)OC1C[C@@](O)(Cc2c(O)c3C(=O)c4cccc(O)c4C(=O)c3c(O)c12)C(=O)CO