Reaction Details
TargetSodium/potassium-transporting ATPase subunit alpha-1
LigandBDBM50408920
Substrate/Competitorn/a
Meas. Tech.ChEMBL_144088 (CHEMBL750866)
IC50 6300±n/a nM
Citation Cerri, AAlmirante, NBarassi, PBenicchio, AFedrizzi, GFerrari, PMicheletti, RQuadri, LRagg, ERossi, RSantagostino, MSchiavone, ASerra, FZappavigna, MPMelloni, P 17beta-O-Aminoalkyloximes of 5beta-androstane-3beta,14beta-diol with digitalis-like activity: synthesis, cardiotonic activity, structure-activity relationships, and molecular modeling of the Na(+),K(+)-ATPase receptor. J Med Chem43:2332-49 (2000) Sodium/potassium-transporting ATPase subunit alpha-1
Name:Sodium/potassium-transporting ATPase subunit alpha-1
Type:PROTEIN
Mol. Mass.:112656.60
Organism:Canis familiaris
Description:ChEMBL_144092
Residue:1021
BDBM50408920
NameBDBM50408920
Synonyms:CHEMBL2069058
TypeSmall organic molecule
Emp. Form.C28H46N2O3
Mol. Mass.458.6764
SMILESCN(C)CCO\N=C\C=C\C=C\[C@H]1CC[C@]2(O)[C@@H]3CC[C@@H]4C[C@@H](O)CC[C@]4(C)[C@H]3CC[C@]12C