Reaction Details
TargetGastrin/cholecystokinin type B receptor
LigandBDBM50089272
Substrate/Competitorn/a
Meas. Tech.ChEMBL_48604 (CHEMBL659585)
Ki 150±n/a nM
Citation Pierson, MEComstock, JMSimmons, RDJulien, RKaiser, FRosamond, JD CCK peptides with combined features of hexa- and tetrapeptide CCK-A agonists. J Med Chem43:2350-5 (2000) Gastrin/cholecystokinin type B receptor
Name:Gastrin/cholecystokinin type B receptor
Type:Enzyme Catalytic Domain
Mol. Mass.:48980.43
Organism:RAT
Description:Cholecystokinin A CCKBR RAT::P30553
Residue:452
BDBM50089272
NameBDBM50089272
Synonyms:CHEMBL312359 | N-(1-Carbamoyl-2-phenyl-ethyl)-3-{2-[3-(1H-indol-3-yl)-2-(2-{4-methylsulfanyl-2-[2-(4-sulfooxy-phenyl)-acetylamino]-butyrylamino}-acetylamino)-propionylamino]-4-methylsulfanyl-butyrylamino}-succinamic acid
TypeSmall organic molecule
Emp. Form.C44H54N8O13S3
Mol. Mass.999.14
SMILESCSCCC(NC(=O)Cc1ccc(OS(O)(=O)=O)cc1)C(=O)NCC(=O)NC(Cc1c[nH]c2ccccc12)C(=O)NC(CCSC)C(=O)NC(CC(O)=O)C(=O)NC(Cc1ccccc1)C(N)=O