Reaction Details
TargetGastrin/cholecystokinin type B receptor
LigandBDBM50089269
Substrate/Competitorn/a
Meas. Tech.ChEMBL_48604 (CHEMBL659585)
Ki 123±n/a nM
Citation Pierson, MEComstock, JMSimmons, RDJulien, RKaiser, FRosamond, JD CCK peptides with combined features of hexa- and tetrapeptide CCK-A agonists. J Med Chem43:2350-5 (2000) Gastrin/cholecystokinin type B receptor
Name:Gastrin/cholecystokinin type B receptor
Type:Enzyme Catalytic Domain
Mol. Mass.:48980.43
Organism:RAT
Description:Cholecystokinin A CCKBR RAT::P30553
Residue:452
BDBM50089269
NameBDBM50089269
Synonyms:CHEMBL276192 | N-(1-Carbamoyl-2-phenyl-ethyl)-3-{2-[3-(1H-indol-3-yl)-2-(2-{2-[2-(4-sulfooxy-phenyl)-acetylamino]-hexanoylamino}-acetylamino)-propionylamino]-6-[3-(2-methyl-benzoyl)-ureido]-hexanoylamino}-N-methyl-succinamic acid
TypeSmall organic molecule
Emp. Form.C56H68N10O15S
Mol. Mass.1153.262
SMILESCCCCC(NC(=O)Cc1ccc(OS(O)(=O)=O)cc1)C(=O)NCC(=O)NC(Cc1c[nH]c2ccccc12)C(=O)NC(CCCCNC(=O)NC(=O)c1ccccc1C)C(=O)NC(CC(O)=O)C(=O)N(C)C(Cc1ccccc1)C(N)=O