Reaction Details
TargetCholecystokinin receptor type A
LigandBDBM50089272
Substrate/Competitorn/a
Meas. Tech.ChEMBL_47646 (CHEMBL657358)
Ki 19±n/a nM
Citation Pierson, MEComstock, JMSimmons, RDJulien, RKaiser, FRosamond, JD CCK peptides with combined features of hexa- and tetrapeptide CCK-A agonists. J Med Chem43:2350-5 (2000) Cholecystokinin receptor type A
Name:Cholecystokinin receptor type A
Type:Enzyme Catalytic Domain
Mol. Mass.:49676.37
Organism:RAT
Description:Cholecystokinin central 0 RAT::P30551
Residue:444
BDBM50089272
NameBDBM50089272
Synonyms:CHEMBL312359 | N-(1-Carbamoyl-2-phenyl-ethyl)-3-{2-[3-(1H-indol-3-yl)-2-(2-{4-methylsulfanyl-2-[2-(4-sulfooxy-phenyl)-acetylamino]-butyrylamino}-acetylamino)-propionylamino]-4-methylsulfanyl-butyrylamino}-succinamic acid
TypeSmall organic molecule
Emp. Form.C44H54N8O13S3
Mol. Mass.999.14
SMILESCSCCC(NC(=O)Cc1ccc(OS(O)(=O)=O)cc1)C(=O)NCC(=O)NC(Cc1c[nH]c2ccccc12)C(=O)NC(CCSC)C(=O)NC(CC(O)=O)C(=O)NC(Cc1ccccc1)C(N)=O