Reaction Details
TargetMetabotropic glutamate receptor 2
LigandBDBM50089890
Substrate/Competitorn/a
Meas. Tech.ChEMBL_106049 (CHEMBL718215)
Ki 2.7±n/a nM
Citation Bräuner-Osborne, HEgebjerg, JNielsen, EOMadsen, UKrogsgaard-Larsen, P Ligands for glutamate receptors: design and therapeutic prospects. J Med Chem43:2609-45 (2000) Metabotropic glutamate receptor 2
Name:Metabotropic glutamate receptor 2
Type:Enzyme
Mol. Mass.:95584.88
Organism:Homo sapiens (Human)
Description:Q14416
Residue:872
BDBM50089890
NameBDBM50089890
Synonyms:4-Amino-2-oxa-bicyclo[3.1.0]hexane-4,6-dicarboxylic acid(LY379268) | CHEMBL89000
TypeSmall organic molecule
Emp. Form.C7H9NO5
Mol. Mass.187.1501
SMILESN[C@]1(COC2[C@@H](C12)C(O)=O)C(O)=O